BDBM50145600 (R)-1-((3S,4R)-4-Benzo[b]thiophen-4-yl-2-methyl-piperidin-1-yl)-3-(2-methyl-1H-indol-4-yloxy)-propan-2-ol::CHEMBL313023
SMILES C[C@H]1C[C@@H](CCN1C[C@@H](O)COc1cccc2[nH]c(C)cc12)c1cccc2sccc12
InChI Key InChIKey=BOTRUCAWYZGOIG-XUVXKRRUSA-N
Data  2 KI
  Tab Delimited (TSV)   2D SDfile   Computed 3D by Vconf -m prep SDfile
Find this compound or compounds like it in BindingDB:
Activity Spreadsheet -- Enzyme Inhibition Constant Data from BindingDB
Found 1 hit for monomerid = 50145600
Target5-hydroxytryptamine receptor 1A(Homo sapiens (Human))
Eli Lilly
Curated by ChEMBL
LigandPNGBDBM50145600((R)-1-((3S,4R)-4-Benzo[b]thiophen-4-yl-2-methyl-pi...)
Affinity DataKi:  1.80nM. Assay description: Binding affinity was evaluated at 5-hydroxytryptamine 1A receptor labeled with [3H]-8-OH-DPAT
In DepthDetails ArticlePubMed